mac compile problems encountered Android source code

2011-05-28  来源:本站原创  分类:Mobile  人气:188 

Speed ​​has been not to force, under the source and then does not want to copy from the same time that the source code over, and now I have been waiting to see the requirements according to the source code into the / Volumes / android / Android-Source directory, and that This directory has been Makefile cts external ndk sdk

bionic dalvik frameworks out system

bootable development hardware packages tools

build device libcore prebuilt

These documents, and I in this directory make, compile is not successful, the following error, we should look at how to solve ah

============================================

PLATFORM_VERSION_CODENAME = AOSP

PLATFORM_VERSION = AOSP

TARGET_PRODUCT = full

TARGET_BUILD_VARIANT = eng

TARGET_SIMULATOR = false

TARGET_BUILD_TYPE = release

TARGET_BUILD_APPS =

TARGET_ARCH = arm

TARGET_ARCH_VARIANT = armv5te

HOST_ARCH = x86

HOST_OS = darwin

HOST_BUILD_TYPE = release

BUILD_ID = OPENMASTER

============================================

find: frameworks / base / frameworks / base / docs / html: No such file or directory

find: out / target / common / docs / gen: No such file or directory

find: frameworks / base / frameworks / base / docs / html: No such file or directory

find: out / target / common / docs / gen: No such file or directory

find: frameworks / base / frameworks / base / docs / html: No such file or directory

find: out / target / common / docs / gen: No such file or directory

find: frameworks / base / frameworks / base / docs / html: No such file or directory

find: out / target / common / docs / gen: No such file or directory

find: frameworks / base / frameworks / base / docs / html: No such file or directory

find: out / target / common / docs / gen: No such file or directory

host Executable: acp (out/host/darwin-x86/obj/EXECUTABLES/acp_intermediates/acp)

host SharedLib: libneo_cs (out/host/darwin-x86/obj/lib/libneo_cs.dylib)

host Executable: aapt (out/host/darwin-x86/obj/EXECUTABLES/aapt_intermediates/aapt)

ld: warning:-read_only_relocs cannot be used with x86_64

true

host SharedLib: libESR_Shared (out/host/darwin-x86/obj/lib/libESR_Shared.dylib)

host Executable: bsdiff (out/host/darwin-x86/obj/EXECUTABLES/bsdiff_intermediates/bsdiff)

host Executable: apriori (out/host/darwin-x86/obj/EXECUTABLES/apriori_intermediates/apriori)

true

host Executable: bspatch (out/host/darwin-x86/obj/EXECUTABLES/bspatch_intermediates/bspatch)

true

host Executable: dexdump (out/host/darwin-x86/obj/EXECUTABLES/dexdump_intermediates/dexdump)

true

true

true

host Executable: dexlist (out/host/darwin-x86/obj/EXECUTABLES/dexlist_intermediates/dexlist)

host Executable: emulator (out/host/darwin-x86/obj/EXECUTABLES/emulator_intermediates/emulator)

host Executable: etc1tool (out/host/darwin-x86/obj/EXECUTABLES/etc1tool_intermediates/etc1tool)

host Executable: imgdiff (out/host/darwin-x86/obj/EXECUTABLES/imgdiff_intermediates/imgdiff)

true

host Executable: make_ext4fs (out/host/darwin-x86/obj/EXECUTABLES/make_ext4fs_intermediates/make_ext4fs)

true

true

true

host Executable: mkbootimg (out/host/darwin-x86/obj/EXECUTABLES/mkbootimg_intermediates/mkbootimg)

host Java: descGen (out / host / common / obj / JAVA_LIBRARIES / descGen_intermediates / classes)

true

true

host SharedLib: libEGL_translator (out/host/darwin-x86/obj/lib/libEGL_translator.dylib)

host Executable: accRuntimeTest (out/host/darwin-x86/obj/EXECUTABLES/accRuntimeTest_intermediates/accRuntimeTest)

host Executable: acc (out/host/darwin-x86/obj/EXECUTABLES/acc_intermediates/acc)

true

true

host SharedLib: libext2_blkid_host (out/host/darwin-x86/obj/lib/libext2_blkid.dylib)

host Executable: pbkdf2gen (out/host/darwin-x86/obj/EXECUTABLES/pbkdf2gen_intermediates/pbkdf2gen)

target thumb C + +: BufferQueue_test <= system / media / opensles / tests / automated / BufferQueue_test.cpp

target thumb C: ash <= system / core / sh / expand.c

true

target thumb C: ash <= system / core / sh / input.c

In file included from system / media / opensles / tests / automated / BufferQueue_test.cpp: 34:

system / media / opensles / include / SLES / OpenSLESUT.h: 1: error: stray '\ 1' in program

In file included from system / media / opensles / tests / automated / BufferQueue_test.cpp: 34:

system / media / opensles / include / SLES / OpenSLESUT.h: 1:10: warning: null character (s) ignored

system / media / opensles / include / SLES / OpenSLESUT.h: 1:12: warning: null character (s) ignored

system / media / opensles / include / SLES / OpenSLESUT.h: 1:14: warning: null character (s) ignored

system / media / opensles / include / SLES / OpenSLESUT.h: 1:16: warning: null character (s) ignored

system / media / opensles / include / SLES / OpenSLESUT.h: 1:18: warning: null character (s) ignored

system / media / opensles / include / SLES / OpenSLESUT.h: 1:20: warning: null character (s) ignored

system / media / opensles / include / SLES / OpenSLESUT.h: 1:22: warning: null character (s) ignored

system / media / opensles / include / SLES / OpenSLESUT.h: 1:24: warning: null character (s) ignored

system / media / opensles / include / SLES / OpenSLESUT.h: 1:26: warning: null character (s) ignored

system / media / opensles / include / SLES / OpenSLESUT.h: 1:28: warning: null character (s) ignored

system / media / opensles / include / SLES / OpenSLESUT.h: 1:30: warning: null character (s) ignored

system / media / opensles / include / SLES / OpenSLESUT.h: 1:32: warning: null character (s) ignored

system / media / opensles / include / SLES / OpenSLESUT.h: 1:34: warning: null character (s) ignored

system / media / opensles / include / SLES / OpenSLESUT.h: 1:36: warning: null character (s) ignored

system / media / opensles / include / SLES / OpenSLESUT.h: 1:38: warning: null character (s) ignored

system / media / opensles / include / SLES / OpenSLESUT.h: 1:40: warning: null character (s) ignored

system / media / opensles / include / SLES / OpenSLESUT.h: 1:42: warning: null character (s) ignored

system / media / opensles / include / SLES / OpenSLESUT.h: 1:44: warning: null character (s) ignored

system / media / opensles / include / SLES / OpenSLESUT.h: 1:46: warning: null character (s) ignored

system / media / opensles / include / SLES / OpenSLESUT.h: 1:48: warning: null character (s) ignored

system / media / opensles / include / SLES / OpenSLESUT.h: 1:50: warning: null character (s) ignored

system / media / opensles / include / SLES / OpenSLESUT.h: 1:52: warning: null character (s) ignored

system / media / opensles / include / SLES / OpenSLESUT.h: 1:54: warning: null character (s) ignored

system / media / opensles / include / SLES / OpenSLESUT.h: 1:56: warning: null character (s) ignored

system / media / opensles / include / SLES / OpenSLESUT.h: 1:58: warning: null character (s) ignored

system / media / opensles / include / SLES / OpenSLESUT.h: 1:60: warning: null character (s) ignored

system / media / opensles / include / SLES / OpenSLESUT.h: 1:62: warning: null character (s) ignored

system / media / opensles / include / SLES / OpenSLESUT.h: 1:64: warning: null character (s) ignored

system / media / opensles / include / SLES / OpenSLESUT.h: 1:66: warning: null character (s) ignored

system / media / opensles / include / SLES / OpenSLESUT.h: 1:68: warning: null character (s) ignored

target thumb C: ash <= system / core / sh / jobs.c

target thumb C: ash <= system / core / sh / main.c

system / core / sh / main.c: In function 'main':

system / core / sh / main.c: 203: warning: comparison between signed and unsigned integer expressions

target thumb C: ash <= system / core / sh / memalloc.c

target thumb C: ash <= system / core / sh / miscbltin.c

In file included from system / media / opensles / tests / automated / BufferQueue_test.cpp: 34:

system / media / opensles / include / SLES / OpenSLESUT.h: 1: error: expected constructor, destructor, or type conversion before '.' token

make: *** [out / target / product / generic / obj / EXECUTABLES / BufferQueue_test_intermediates / BufferQueue_test.o] Error 1

make: *** Waiting for unfinished jobs ....

相关文章
  • mac compile problems encountered Android source code 2011-05-28

    Speed ​​has been not to force, under the source and then does not want to copy from the same time that the source code over, and now I have been waiting to see the requirements according to the source code into the / Volumes / android / Android-Sourc

  • In Ubuntu 9.04 compile Android source code 2010-09-21

    In Ubuntu 9.04 compile Android Source] [reserved Source: blog.douhua.im of: douhua Brush the official version has been prepared to look at their compiled Brush. First, download, Android source code is hosted in the Linux Kernel source site, so versio

  • Android source code to obtain and compile 2010-09-23

    How to compile Android source code, what is the information from the network to find, after their successful certification to obtain and compile the source. 1, need to install some additional packages, in Ubuntu (I use the system) can be used under t

  • Android source code access and compile 2010-09-23

    How to compile Android source code, what is the information from the network to find, through their source code verification to obtain and compile successfully. 1, the need to install some additional packages, in Ubuntu (I use the system) can be used

  • Android source code to the SDK 2010-03-29

    When you debug Android programs encounter "source not found" error should be very crazy bar, Goolge, when the release of SDK did not really go in the source code contains a bit confusing for many people, Git is undoubtedly a jerky thing, but fra

  • Android source code under the "system development" - Settings example 2010-09-04

    In the Android development process, often encounter a lot of hidden top-level programmers API can not be used, this time we can consider the Android source code under a "system-level" development, the so-called "system-level development&quo

  • Android source code to the SDK (Updated) 2010-11-05

    When you debug the program encountered Android "source not found" error should be very crazy, right, Goolge the release of SDK contains the source code did not really get a little confusing, no doubt to many people, Git is a jerky thing, and add

  • JAVA version of Android source code problem 2010-11-08

    Android source code now requires Java Development Environment version 1.5. At the time when the development environment to build, did not notice the java version of the requirement to install the 1.6 version of java. Results compiled a java version w

  • Android source code editor with all the operations related to introduction 2010-12-02

    Android source code editor with all the operations related to introduction Android source code related to Note: The following is carried out in the ubuntu 10.04. The birth of this article, my internship at the Meizu learned the past two months, who h

  • How to use Eclipse to develop Android source code 2010-03-29

    Using eclipse + ADT as an android development tool, it can be said is very convenient, in HelloActivity applet where we feel the eclipse feature rich and powerful. So, we can use eclipse to develop android source code do? If we directly import the an

  • (Reprinted) how to use Eclipse to develop Android source code + comments 2010-07-23

    Android with eclipse + ADT as a development tool, can be very convenient, in HelloActivity applet in eclipse features we feel great. So, we can use eclipse to develop android source it? If we direct the android source code in a project into eclipse,

  • ubuntu Android source code modules compiled under 2010-09-19

    [Reserved] 1. Download Android source code of the process is not said, a lot of online information 2. The steps to install jdk1.5 not say, a lot of online information 3. Download the source code I put in the directory is / home / wuyutaott / android

  • Android source code compiled 2010-12-13

    In the out / target / product / generic image file generated under the three: ramdisk.img, system.img, userdata.img and their corresponding tree root, system, data. ramdisk.img is the root file system, system.img including the main package, libraries

  • Made using Cygwin in Windows, Android source code 2010-03-23

    Made using Cygwin in Windows, Android source code 1, ready to Cygwin environment, which should curl, wget, python and other basic tools. 2, ready source storage directory (eg: c: \ myeclair), into the Cygwin Shell environment, execute the following c

  • Use Git to download Google Android source code 2010-07-14

    Article from: http://zzmccnu.javaeye.com/blog/457297 collection of about Use Git to download Google Android source code Preparation of resources Android Resources Distribution Description: http://source.android.com/projects # TOC-External-projects An

  • ゞ Android - Miscellaneous - Android source code download ゞ 2010-10-26

    1. Install Cygwin details, see Annex 2.PATH = "$ PATH": / dir to set environment variables can not add a space before and after = number http://source.android.com/source/download.html http://huaweiren.blog.51cto.com/53260/271559 Install cygwin,

  • Android, how to view the eclipse of the version of Android source code? 2010-11-27

    Android, how to view the eclipse of the version of Android source code? See: Details

  • Android source code quality 2010-12-02

    http://www.ophonesdn.com/forum/forum-17-1.html Android games from scratch Programming Backgammon source Read RSS on OPhone Tetris 1945 Air Combat Game Acceleration sensor demo Demonstrates how to use the Location and Google Map Stock Collection Lianl

  • Android source code in Eclipse View 2011-05-31

    Only 5M to android Source: http://d.download.csdn.net/down/1429398/GoWish After downloading the source code for Android, how in the Eclilpse Android source code inside the view? See on the Internet are many ways, I feel very complicated, if you just

  • Ubuntu 8.04 compile the whole process of Android source code 2010-08-28

    First, the source code for Android Git is a linux Torvalds (Linux father) to help manage Linux kernel development and the development of an open source distributed version control software, which is different from Subversion, CVS such a centralized v